PLACE,DUPLICATE,TRANSCRIPTION,CREATED,USER_ID,ACCESS,LOCATION,CATMSG,SENDER,TONE,LANG,CLEDIT,MEDIUM,IMAGES,MULTILING,URL,CONTACT,TECH,COLOR
Public Place,1,"Hille Kyrka ORGELINVIGNING TORSDAG 8 SEPTEMBER KL 18.30 INVIGNINGSKONSERT/ORGELPAUS PER AHLMAN, DIPLOMORGANIST MINGEL MED CIDER OCH SNACKS EFTERÅT LÖRDAG 10 SEPTEMBER KL 18 MUSIK VID HELGSMÅL ELLEN WEISS SÅNG MARIANNE HEIN-NORDSTRÖM ORGEL SÖNDAG 11 SEPTEMBER KL 16 ORGELGUDSTJÄNST KYRKOKÖREN FINNDÍSS KRISTINSDÓTTIR VIOLIN, MARIANNE HEIN-NORDSTRÖM, ELLEN WEISS OCH MARIE SÖDERQUIST Varmt välkommen Svenska Kyrkan I HILLE",2016-09-15 14:29:21,1871,,2,14,1,2,1,Y,2,5,1,NO,4,4,2
Public Place,1,"Tomas DiLeva HJÄRTAT VINNER ALLTID HILLE KYRKA, GÄVLE SÖNDAG 30 OKTOBER KL 18:00 MED HILLE KYRKOKÖR OCH UNGDOMSKÖRERNA HOPPET & KRAM UNDER LEDNING AV ELLEN WEISS BILJETTER: WWW.DILEVA.SE/BILJETTER GÄVLE TURISTCENTER ### - ## ## ##",2016-09-29 10:40:47,1871,,2,20,1,2,1,Y,3,2,1,YES,1,4,2
Public Place,1,SOPPLUNCH Ons 21 sept kl 12.30 Hille Församlingsgård NN sjunger och berättar Svenska Kyrkan I HILLE,2016-09-29 10:44:20,1871,,2,20,1,2,1,Y,3,2,1,NO,4,4,2
Supermarket,1,"Barnprylsmarknad Lördag 24:e september kl: 10-12 i Klittens Bystuga Älvdalen Välkomna! Lekhörna och fikaförsäljning finns, glutenfria, mjölkfria och sockerfria alternativ Vid frågor och anmälan maila @@@",2016-09-17 08:53:11,1880,,1,2,8,2,1,Y,2,3,1,NO,3,2,1
Supermarket,1,Skogsturer för nybörjare Köp Present-kort ! Ponnyridning på kalaset Vi kommer hem till dig Övriga aktiviteter * lär dig sköta * träna balans * annat enl ök Ring för bokning ###,2016-10-19 12:40:32,1970,,1,3,2,2,1,Y,2,2,1,NO,1,1,2
Supermarket,1,Hus eller lägenhet Önskas hyra. Av liten skötsam familj. Allt av intresse. tele ###,2016-10-19 12:44:16,1970,,1,5,7,2,1,Y,1,1,1,NO,1,1,1
Supermarket,1,"Bräkne-Hoby Bygdegård Uthyres till föreningar för kurser och konferenser. Privata fester som bröllop, födelsedagar, barnkalas, m.m. Kostnad: Stora salen med kök 800:- Dukning dagen före 300:- Stora salen utan kök 600:- Kontakta: NN, ### NN, ###",2016-10-19 12:48:18,1970,,1,5,7,2,1,Y,2,2,1,NO,1,1,2
Supermarket,1,"KÄLLA BY RIVNING - ALLTjÄNST GÖR DET MESTA UTOM EL, VATTEN INNER HAR F-SEDEL TEL ###",2016-10-19 12:51:21,1970,,1,3,7,1,1,Y,1,1,1,NO,1,1,1
Supermarket,1,"TILL SALU TILLBEHÖR VERKTYG RESERVDELAR FÖR BÅT ALLTID BRA PRIS PÅ OLJOR Personlig service även kvällar och helger Ring, skicka sms eller mail – alla förfrågningar besvaras Mobil ### Mailadress @@@",2016-10-19 12:56:56,1970,,1,2,7,2,1,Y,2,2,1,NO,3,1,2
Supermarket,1,ALLT INOM BYGG & RENOVERING SNICKERI ARBETEN FONSTERBYTEN (egen import) NN - MURNING - PUTS - KAKELSÄTTNING - MÅLNING MM. INOM BYGG MOBIL : ###,2016-10-19 12:59:41,1970,,1,3,2,1,1,Y,3,3,1,NO,1,1,2
Supermarket,1,"Hus.–Trädgård.–Service Svängsta Räcker tiden inte till? Värker Ryggen? vi erbjuder tjänster för hus,hem, och trädgårdsvård Tjänster VVS (vatten,avlopp,gas,värme) Trädgård (gräs,häckklipp,rabatter) Måleri (inne,ute,fönster,möbler) Städ och Flytthjälp Byggtjänster (av nytt, renovering) Har F-skatt och RUT/ROT För uppdrag,kostnadsförslag och frådor: NN: ### ### NN: ### Hemsida: www.t-t-s-svaengsta.com",2016-10-19 13:06:41,1970,,1,3,2,2,1,Y,2,3,1,YES,1,1,2
Supermarket,1,"Moped, mopedobjekt köpes! Söker en moped eller ett mopedobjekt, intresserad av alla lite äldre mopeder, t ex: PUCH, Crescent, Zündapp, Monark, Husqvarna, Mustang, Yamaha FS1, Yamaha DT, Honda MT, Chappy, Flakmoped m fl. Så tveka inte att höra av dig, om du har någon moped ståendes, oavsett skick! Ring eller sms:a Med vänlig hälsning NN",2016-10-19 13:09:04,1970,,1,2,7,2,1,Y,2,1,1,NO,1,1,1
Supermarket,1,"Håll ett Perfect Home party Perfect Home är Nordens största homepartyföretag inom heminredning och presentartiklar. Våra produkter är alltid populära och vi erbjuder en kollektion som faller de flesta i smaken. Bjud in vänner, familj och kollegor till en intressant och trevlig Perfect Home demonstration. Förutom nya erbjudanden varje månad har du som värdinna fina fördelar. -Du kan få en GRATIS tackgårva - Du kan få valfria produkter till 1 / 2 priset Ring mig redan idag och avtala ett Perfect Home party. Namn: NN Tel/ mob: ###",2016-10-19 13:11:00,1970,,1,2,2,2,1,Y,2,2,1,YES,1,1,2
Supermarket,1,"Skonsam träning? AB Cirle Pro (batteridriven dator ingår) Känd från TV-shop. och Gåstavar med gasfjädring (Energy Bumbypump) (x-tra-gummi och snöringar medföljer) Allt mycket välskött och mycket litet använt. Pris: 1000 kr för båda, eller 600kr/träningsredskap Säljes av NN, ###",2016-10-19 13:13:45,1970,,1,2,7,2,1,Y,2,1,1,NO,1,1,1
Supermarket,1,"Turridning på islandshästar i natursköna områden. Genom skogar, över ängar, längst med havet. 2 timmars tur med fika 480 kr 4 timmars tur med lunch 950 kr Vi gör även specialarrangemang Välkommen! Väbylunds Islandshästar 372 63 Bräkne-Hoby www.vabylund.se ###",2016-10-19 13:15:23,1970,,1,3,2,2,1,N,2,2,1,YES,6,1,1
Supermarket,1,HÖSTRENGÖRING I TRÄDGÅRDAR UTFÖRS Tel. ###,2016-09-18 18:12:17,1874,,1,3,7,1,1,Y,2,1,1,NO,1,2,1
School,1,"EN DEMOKRATIDAG På Riktigt! ATT TILLSAMMANS GÖRA SKILLNAD 9.30-14.00 ONS 5 OKTOBER FJÄLLRÄVEN CENTER På Riktigt! är ett möte mellan ungdomar, politiker och tjänstepersoner. I din kommun. Sista anmälningsdag är den tjugotredje september. orskoldsvik.se/ungasinflytande ungivok Örnsköldsviks kommun – Ung ÖRNSKÖLDSVIKS KOMMUN",2016-09-19 06:42:51,1855,2,1,12,4,1,1,Y,3,3,1,YES,6,1,2
School,1,"KARATE FÖR VUXNA Styrka - Smidighet - Självförsvar NYBÖRJARSTART Prova på gratis september ut! Vi kör igång träningen för vuxna 13 år och uppåt 2 gånger per vecka med start måndag 5/9 i Parkskolans gymnastiksal tid: kl. 19.00 Utnyttja möjligheten att träna hela familjen, Örnsköldsvik Shotokan Karateklubb ger familjerabatt!! För information NN ### NN ###",2016-09-19 06:54:39,1855,1,1,18,1,1,1,Y,2,2,1,NO,1,4,2
School,2,"VI MÖTS PÅ MITTEN MUSIK KOMIK TEATER Av och med Stina Joza och Jens Nilsson FOLKAN ÖRNSKÖLDSVIK 9–10 SEPTEMBER Tid 19:00. Pris: 225 kr. Förköp: Turistbyrån, Ticnet.se, Folkan Örnsköldsvik.",2016-09-19 06:56:09,1855,1,2,20,2,2,1,Y,3,2,1,YES,6,1,2
School,1,HIGH COAST DIVING - Vi utbildar dig inom dykning BOKA din plats på www.highcoastdiving.com Evenemang PADI Open Water Diver (Grundkurs i dykning) Datum Start 5 Sept Pris 4795kr www.highcoastdiving.com Telefon: ### ### Adress: Parkgatan 7 89134 Örnsköldsvik @@@ www.highcoastdiving.com,2016-09-19 06:57:07,1855,,1,3,2,2,1,Y,3,2,1,YES,6,1,2
School,1,WILL YOU BE THE LAST MAN STANDING NOLASKOLANS ELEVRÅD,2016-09-19 06:42:45,1855,2,1,24,1,2,3,Y,3,1,2,NO,5,1,2
School,1,"VI MÖTS PÅ MITTEN MUSIK KOMIK TEATER Av och med Stina Joza och Jens Nilsson FOLKAN ÖRNSKÖLDSVIK 9–10 SEPTEMBER Tid 19:00. Pris: 225 kr. Förköp: Turistbyrån, Ticnet.se, Folkan Örnsköldsvik.",2016-09-28 09:05:01,1876,2,2,20,2,2,1,Y,3,2,1,YES,6,3,2
School,1,"Förbud mot nötter, jordnötter, mandel och sesam Många barn och ungdomar är allergiska mot nötter, jordnötter, mandel eller sesam. En person som är svårt allergisk kan får en livshotande allergichock om hon av misstag får i sig detta. För att alla ska kunna känna sig trygga har vi därför infört ett fullständigt förbud mot nötter, jordnötter, mandel och sesam på skolans område. Förbudet gäller vid all verksamhet och efter skiltid – skolmat, fritidsverksamhet, disco, fester, personal- och föräldrafika med mera. Det gäller dygnet runt året om, alltså även då lokalerna hyrs ut. Tack för att du respekterar vårt beslut! ÖRNSKÖLDSVIKS KOMMUN",2016-09-19 06:44:40,1855,2,1,24,4,1,1,Y,2,2,1,NO,5,1,2
School,1,"START Res dig. Sträck på dig. Rör på dig. Om två månader är du piggare, gladare och friskare. motion – det är du värd TÄVLA OCH VINN EN SPAHELG ELLER ETT GYMKORT! Så här gör du för att vara med i tävlingen: • Bestäm dig för att börja motionera. • Anmäl dig till någon eller alla tre tävlingsperioderna. • Anmäl dig senast dagen innan perioderna börjar. TÄVLINGSPERIODER • 1 oktober-30 november 2016 • 1 januari-28 februari 2017 • 1 april-31 maj 2017 Anmäl dig på startmotion.se",2016-09-19 06:53:28,1855,2,1,18,2,2,1,Y,3,3,1,YES,2,1,2
School,1,TRYCK Tryckfriheten 250 Utställning om tryckfriheten som i år fyller 250 år 12 september - 30 september FH Gnistans kafe arr. ABF Västernorrland & Folket i bild kulturfront,2016-09-19 06:57:15,1855,2,1,20,1,1,1,Y,3,3,1,NO,5,3,2
School,2,"Anmäl till NN senast 22/9 EN DEMOKRATIDAG På Riktigt! ATT TILLSAMMANS GÖRA SKILLNAD. 9.30-14.00 OST 5 OKTOBER FJÄLLRÄVEN CENTER På Riktigt! är ett möte mellan ungdomar, politiker och tjänstepersoner. I din kommun. Sista anmälningsdag är den tjugotredje september. ornskoldsvik.se/ungasinflytande ungivok Örnsköldsviks kommun – Ung ÖRNSKÖLDSVIKS KOMMUN",2016-09-19 07:05:19,1855,,1,12,4,1,1,Y,3,1,1,YES,2,1,2
School,2,"KARATE FÖR VUXNA Styrka - Smidighet - Självförsvar NYBÖRJARSTART Prova på gratis september ut! Vi kör igång nybörjarträningen för vuxna 13 år och uppåt 2 gånger per vecka med start måndag 5/9 i Parkskolans gymnastiksal tid: kl. 19.00 Uttnytja möjligheten att träna hela familjen, Örnsköldsvik Shotokan Karateklubb ger familjerabatt!! För information NN ### NN ###",2016-09-19 07:16:42,1855,,1,18,1,2,1,Y,2,2,1,NO,1,1,2
School,2,WILL YOU BE THE LAST MAN STANDING NOLASKOLANS ELEVRÅD,2016-09-22 11:17:59,1855,2,1,24,1,2,3,Y,3,1,2,NO,5,1,2
School,2,"START Res dig. Sträck på dig. Rör på dig. Om två månader är du piggare, gladare och friskare. Motion- det är du värd TÄVLA OCH VINN EN SPAHELG ELLER ETT GYMKORT! Så här gör du för att vara med i tävlingen: * Bestäm dig för att börja motionera. * Anmäl dig till någon eller alla tre tävlingsperioderna. * Anmäl dig senast dagen innan perioderna börjar. TÄVLINGSPERIODER * 1 oktober-30 november 2016 * 1 januari-28 februari 2017 * 1 april-31 maj 2017 Anmäl dig på startmotion.se",2016-09-22 11:23:54,1855,,1,18,2,2,1,Y,3,3,1,YES,2,1,2
School,1,I AM CONFIDENT. I AM INDEPENDENT. I AM A CITIZEN OF THE WORLD. I AM AN AU PAIR Cultural Care Au Pair CULTURALCARE.SE ###,2016-09-19 11:08:10,1897,,1,24,2,2,3,Y,3,1,1,YES,6,1,2
School,1,"VOLONTÄR i Nepal, Ecuador, Indien och Tanzania Res ut i världen, engagera dig och kom hem med ett större hjärta! www.skandinaviskainstitutet.se",2016-09-19 11:09:33,1897,,1,20,1,2,1,Y,3,2,1,YES,2,1,2
School,1,"IF YOU HAVE A PROBLEM WITH ME, GIVE ME A CALL. IF YOU DON'T HAVE MY NUMBER THEN THAT MEANS YOU DON'T KNOW ME WELL ENOUG TO HAVE A PROBLEM..! www.Daveswordsofwisdom.com",2016-09-19 11:12:25,1897,,1,24,8,2,3,Y,2,3,1,YES,2,1,2
School,1,Winter…. Not My Season.,2016-09-19 11:13:28,1897,,1,24,7,2,3,Y,2,2,1,NO,5,1,2
School,1,Never ever give up!,2016-09-19 11:15:00,1897,,1,24,7,2,3,Y,2,3,1,NO,5,1,2
School,1,SELF CONTROL the only way to survive in this world dominated by idiots,2016-09-19 11:16:55,1897,,1,24,7,2,3,Y,2,2,1,NO,5,1,2
School,1,"""Att gnälla är som att gunga gungstol. Man har nåt att göra, men kommer ingenstans.""",2016-09-19 11:17:48,1897,,1,24,7,2,1,Y,2,1,1,NO,5,1,2
School,1,"Välkommen till Falu kommuns nya trådlösa gästnät Från och med fredag 25 september öppnar IT- kontoret det nya gästnätet. Det innebär att ""Karma-konton"" samt biljetter erätts med en modernare teknik. Vi vänder oss till alla gäster, anställda, elever och partners som befinner sig i Bibliotek, Slättanläggningarna, Lugnetanläggningarna samt alla skolor. FKGUEST visas som ett alternativ nätverk i de mobila enheterna Bild 1 kommer att visas vid val av nätverket FKGUEST. Bild 1 Är du redan kund, elev, partner eller anställd kan du logga in med ditt användarnamn och lösenord. Endast anställda loggar in enligt följande exempel ""admfalun\aaa01"". I annat fall skapar du ett gästkonto genom att klicka på länken ""skapa gästkonto"" enligt nedan. Inloggningsuppgifter skickas via SMS och kräver alltså en mobiltelefon. Fyll i fälten enligt bild 2. Bild 2",2016-09-19 11:41:04,1897,,1,24,4,1,1,Y,2,1,1,NO,5,1,2
School,1,"Sveriges lantbruksuniversitet Swedish University of Agricultural Sciences Science and Education for Sustainable Life Vill du lösa dagens och morgondagens miljöproblem och bidra till att fler kan äta sig mätta? Då är #pluggahållbart något för dig! Följ studenternas vardag: www.facebook.com/pluggahallbart www.instagram.com/pluggahallbart www.slu.se/pluggahallbart/ Våra utbildningar ger jobb: Agronom-ekonomi, Agronom-landsbygdsutveckling, Agronom-livsmedel, Agronom-mark/växt, Biologi och miljövetenskap, Ekonomi-kandidat",2016-09-19 11:13:49,1897,,1,3,3,1,1,Y,,,,,,,
School,1,"STUDERA I ENGLAND ✔ Topprankade universitet och brett programutbud ✔ Flexibelt antagningssystem (inte bara snittbetyg) ✔ Unika utbildningar, ofta med fokus på att ""få jobb"" ✔ Praktik är ofta en del av utbildningen ✔ Ökade språkkunskaper, bra erfarenhet, lärorikt ✔ Spetsa ditt CV, få högre lön! ✔ Billigare än andra engelsktalande länder Hjälp med UCAS ansökan och gratis studierådgivning Boka studierådgivning eller fråga oss på www.educationlink.se Education Link facebook.com/educationlinksverige ### www.educationlink.se",2016-09-19 11:14:48,1897,1,1,6,2,2,1,N,3,5,1,YES,6,1,2
Supermarket,1,"Har någon sett mig? Vänligen ring min ägare: NN ### Sköldpaddsfärgad, kastrerad, honkatt på 6 månader. Taturing i vänster öra, chippad! Bor på Smedstorpsgård! Borta sedan Torsdag 10/3 TACK!",2016-09-19 11:19:00,1869,,2,9,7,1,1,Y,2,2,1,NO,1,2,2
Supermarket,1,"STOCKHOLM NORD KARATEKLUBB Okinawa Goju Ryu TRADITIONELL KARATE & KOBUDO VÄLKOMMEN TILL VÅR NYBÖRJARINTAGNING För mer information om tider och datum, besök www.stockholmnordkk.se",2016-09-19 11:20:00,1869,,2,18,1,2,1,Y,3,2,1,YES,6,3,2
School,1,"Falu Kommun SCHEMA Läsåret 2016-17 Falu kommun Klass: VO16 Utskriftsdatum: 2016-08-22 Ansvarig lärare: NN, NN Måndag Tisdag Onsdag Torsdag Fredag Matte 3b MAGRUND klassråd Ej,v46-50 TSE02 ELI15 Matte 3b MAGRUND klassråd Ej:v46-50 HISHIS01a1 Ej:v46-50 AOR03 213 HALHAL0 Ej.v46-50 TSE02 213 SVASVA01 Ej v46-50 MEN12 114 SVESVE01 Ej v46-50 ALA06 HISHIS01a1 Ej:v35, 37, 39, 41, 43, 46-50 AOR03 213 ENGENG05 Ej:v46-50 TSE02 213 MATMAT01a Ej:v46-50 CHA02 213 ENGENG05 Ej:v46-50 ENGENG05 Ej:v46-50 VÅRVÅR01 Ej:v46-50 ELI15 213",2016-09-19 11:27:38,1897,2,1,24,3,1,1,Y,2,1,1,NO,6,1,1
School,1,"Falu Kommun SCHEMA Läsåret 2016-17 Falu kommun Klass: VO15 Utskriftsdatum: 2016-08-22 Ansvarig lärare: NN, NN Måndag Tisdag Onsdag Torsdag Fredag",2016-09-19 11:28:36,1897,2,1,24,3,1,1,Y,2,1,1,NO,6,1,1
School,1,"Falu Kommun SCHEMA Läsåret 2016-17 Falu kommun Klass: VO14 Utskriftsdatum: 2016-08-22 Ansvarig lärare: NN, NN Måndag Tisdag Onsdag Torsdag fredag",2016-09-19 11:29:14,1897,2,1,24,3,1,1,Y,2,1,1,NO,6,1,1
School,1,På Kristinegymnasiet … visar vi hänsyn … stödjer och hjälper vi varandra … lyssnar vi på varandra … kommer vi i tid … tar vi med oss rätt arbetsmaterial … håller vi skolan ren … är vi rädda om material och utrustning … har vi en rökfri miljö inom skolans område ... använder vi mobiler och datorer med syfte att främja undervisningen Enligt beslut på Skolrådet 2014-03-12,2016-09-19 11:30:25,1897,2,1,24,3,1,1,Y,2,3,1,NO,6,1,1
School,1,UTTAGNING AV NY STYRELSE! GÅR DU I ÅRSKURS 2? SÖK TILL DALA GYMNASISTFÖRENING OCH ARRANGERA FALUNS STUDENT! LÄROVERKSPARKEN 12/9 & 14/9 KL. 17:00 VI BJUDER PÅ FIKA! VÄLKOMMEN! Du behöver bara komma på en utav dagarna!,2016-09-19 11:30:38,1897,2,1,24,3,2,1,Y,2,3,1,NO,4,1,1
School,1,KRISGRUPPEN I KRISTINEGYMNASIET NN Skolsköterska NN Kurator NN Specialpedagog NN Biträdande rektor NN Vårdlärare NN Skolassistent NN Datatekniker NN Köket,2016-09-19 11:31:15,1897,2,1,24,3,1,1,Y,2,2,1,NO,5,1,2
School,1,Likabehandlingsgruppen/Antimobbingteam NN NN NN NN NN NN NN NN Antibobbingsteamets samordnare NN NN,2016-09-19 11:31:52,1897,2,1,24,3,1,1,Y,2,2,1,NO,5,1,2
School,1,"22 sep. ÖPPET HUS på Sophiahemmet Högskola om sjuksköterskeprogrammet Sida 1 av 2 Stockholm Om ditt nyhetsbrev ser konstigt ut i din e-postklient, klicka här. SOPHIAHEMMET HÖGSKOLA Hemsida | Skicka vidare | Prenumerera | Avprenumerera ""Sjuksköterskeprogrammet på Sophiahemmet Högskola är mer än bara en utbildning"" Jonas, student SJUKSKÖTERSKEPROGRAMMET 180 hp Vålkommen till ÖPPET HUS på Sophiahemmet Högskola! Datum: 22 september 2016 Tid: kl 15.30-17.00 Plats: Sophiahemmet Högskola, Valhallavägen 91, ingång R, plan 2, Stockholm Ingen föranmälan behövs, drop-in gäller kl 15.30-17.00 - ÖPPET HUS • Kom och ta chansen att strosa runt i våra trevliga lokaler, besök vårt fina bibliotek och framför allt ta reda på mer om Sjuksköterskeprogrammet och vidareutbildningar. På de olika informationsstationerna har du dessutom möjlighet att träffa studievägledare, lärare och studenter och ställa frågor. Det kommer även att finnas prova-på moment som ingår i utbildningen. kl 16.00-16.45 - Särskilt informationstillfälle om sjuksköterskeprogrammet, 180 HP Erforssalen • Studierektor NN hälsar välkommen och berättar om en utbildning på grundnivå • Lärare + två studenter berättar om sjuksköterskeprogrammet • Frågor Hör gärna av dig om du har några frågor: @@@ Skriv gärna ut PDF om ÖPPET HUS och sätt upp på er skola!",2016-09-19 11:32:51,1897,2,1,24,8,1,1,Y,2,5,1,NO,3,1,1
Public Place,1,"Tobbe Petersson spelar på Edsviks Musikfestival 27 aug. kl 18.00, fri entré",2016-09-19 11:47:38,1869,,2,3,2,2,1,Y,3,2,1,NO,4,1,2
,1,BLUESKVÄLL MED JOHNNY & FRIENDS Gamla Pumphuset 30/9 Förköp: Pumphuset,2016-09-19 13:39:27,1856,,,3,2,2,1,Y,4,2,1,NO,4,1,2
,1,UNDER KULTURKOLLISIONEN LÖRDAGEN 17/9 HAR GALLERI KRÅKAN EXTRA ÖPPET: 18.00 - 21.00. VÄLKOMNA!!,2016-09-19 13:49:29,1856,,,3,1,2,1,Y,2,2,1,NO,4,1,2
,1,SÄLJES! 18/9-16 Helt komplett LUX Royal-Dammsugare! + Filter +påsar 12:000! Prutat å KlaRt! Använd bara 3 månader! Helt felfri! ### ###,2016-09-20 10:28:20,1856,,,2,7,2,1,Y,1,1,1,NO,1,1,1
,2,BLUESKVÄLL MED JOHNNY & FRIENDS FREDAG 30/9 - PUMPHUSET BILJETTER: FÖRKÖP PUMPHUSET 100 kr DÖRRARNA ÖPPNAR KL : 20.00 Kvällens ERBJUDANDE:KYCKLINGSPETT/ÖL 100 KR. OBS! BEGRÄNSAT ANTAL,2016-09-20 11:12:59,1856,,,3,2,2,1,Y,4,2,1,NO,4,1,2
,1,"Till Salu! Damcykel Cresent, blå rund ram 3 vxl. Fot o hand broms 400 :– ###",2016-09-20 11:14:24,1856,,,2,7,2,1,Y,1,1,1,NO,1,1,
,1,"SKORSTENSSKYDD Öppningsbara huvar i stabil hållbar konstruktion med fågelnät i gavlarna Huvarna finns i svart ,tegelröd Samt mörkröd kulör Pris med rot från 2400kr ink moms priset innefattar mätning ,tillverkning samt montering snabb leverans ! Utför även övrig byggplåt som exempelvis ;falsade plåttak ,skorstensbeslag Fönsterbleck vindskivor mm och stora och små ventilations anläggningar ex vis Villaventilation med återvinningsbatteri ,takfläktar ,köksfläktar mm till vettiga priser. 25år i branschen F-skatt finns Ring för mer info ###",2016-09-20 12:02:50,1856,,,2,7,2,1,Y,2,2,1,NO,1,1,
,1,lnnebandybutiken ger 20% rabatt till alla kunder KIB BJUDER IN BYTESMARKNAD Kläder & Utrustning På Innebandybutiken 18 september - 2016 InIämning: kl. 09.30-11.00 Försäijning: kl. 12.00-14.00 Undermåliga saker tas ej emot Välkommen att fynda!,2016-09-20 12:13:32,1856,,,2,2,2,1,Y,2,5,1,NO,4,1,
,1,"ABF Hösten 2016 Datakurs för nybörjare! Lär dig Datakunskaper i lugn och ro under Iedning av kunnig ledare Ledare NN; Datalärare Dag: Onsdag Tid: 10:00 – 12:00 eller 16:00 – 18:00 Start: 5 oktober Antal ggr: 6 gg á 3 studietimmar Kostnad: 800 kr ordinarie pris Medlemspris 600 kr (om du medlem i ABF:s organisationer) Kursinnehåll: Internet, skriva enkla dokument, söka information, e-legitimation, e-post samt bankärenden mm. Anmälan sker till ABF i Karlskoga, Kungsvägen 38, senast den 25 september. Telefon: ### eller ### Varmt välkomna!",2016-09-20 12:19:49,1856,,,3,1,1,1,Y,2,3,1,NO,1,1,
,1,Nu fyller vi Nobelhallen. BIK Karlskoga 1978 BIK Karlskoga vs IK Oskarshamn Torsdag 22/9 19.00 Nobelhallen Ståplats: Förköp: Vuxen 130:- Pensionär 90:- Barn & ungdom 0:- Arenan: Vuxen 150:- Pensionär 110:- Barn & ungdom 0:- Sittplats Förköp: Vuxen 190:- Pensionär 150:- Barn & ungdom 60:- Arenan: Vuxen 210:- Pensionär 170:- Barn & ungdom 80:- Köp din biljett på : www.bikkarlskoga.se,2016-09-20 12:33:00,1856,,,18,1,2,1,Y,3,3,1,YES,4,1,
,1,SKIN FOTTÖLJ KLÄDER. HERR SÄNG TV. BÄNK. + BÄNK PORSLIN 1500:– KÖKSBORD+1 stol ### ###,2016-09-21 09:57:42,1856,,,2,7,1,1,Y,1,1,1,NO,1,1,1
,1,"GALLERI KRÅKAN Hotellgatan 8, Karlskoga NN VISAR AKVARELLER 6/9-18/9 2016 VERNISSAGE TISDAG 6/9 16.00-19.00 ÖPPET: TISDAG-SÖNDAG 12.00-16.00",2016-09-21 10:49:08,1856,,,20,7,2,1,Y,2,2,1,NO,4,1,
,1,Diverse till salu Karlskoga Tallrik Lövfat 2 st plåtboxar med 8 DVD filmer som spänner över Elvis Presleys hela liv: På Engelska och Tyska Kam och Karda 3 Låscylindrar med 5 nycklar Kundkoppel rött 2 Plädar 10 glas mönstrade med guldkant 4 glas med handtag För mer information och bilder på det som är till salu Ring eller maila till @@@ Mobil ###,2016-09-21 11:04:53,1856,,,2,7,1,1,Y,2,1,1,NO,6,,
,1,"Har du planer på att åka på landskamp? Vill du det ska synas att du stöttar Svenska landslag? Med ""SverigeMössan"" lovar vi att du kommer att väcka uppmärksamhet och det finns ingen tvivel om vem du hejar på! Gå in på www.sverigemossan.se för kontakt och prisinformation. NN och NN",2016-09-21 11:11:07,1856,,,2,7,2,1,Y,2,2,1,YES,2,1,
,1,Grilltur Vi startat med turridning Deen håller på i ca 3 timmar 25 Sep – Grillningen börjar kl 15.00 Turen startar kl 11.00 Mycket ridning o god mat . Ta med ombyte ifall det regnar eller mysisar till grillningen. Hemma hos NN Södra Öfalla 145 69192 Granbergsdal på telefon ###,2016-09-21 11:12:59,1856,,,18,7,2,1,Y,2,1,1,NO,1,,1
,1,TILL SALU 2 s.t plåtboxar med 8 DVD filmer som spänner över Elvis Presleys hela liv: På Engelska och Tyska 10 glas mönstrade med guldkant ### @@@,2016-09-21 11:14:22,1856,,,2,7,1,1,Y,2,2,1,NO,6,1,
,1,VI ÄR HÄR FÖR ATT HJÄLPA DIG! Behöver ni hjälp att kasta ert gods till återvinningscentralen? Inga problem! Vi hjälper dig gärna. Vi kastar allt ris åt dig för endast 200kr/last. Övriga gods 250-350kr/last. Ring för mer information och tidsbokning: Tel: ### Återvinningscentralen,2016-09-21 11:18:26,1856,,,3,2,1,1,Y,2,1,1,NO,1,1,
,1,Säljes Expansions.kärl. Ford. 500:– tel ### tryck-provat.,2016-09-21 11:55:46,1856,,,2,7,1,1,Y,2,2,1,NO,1,1,2
,1,Sparbanksbörsen Fjugesta Spanska flugan 15 okt - 12 nov 375 kr inkl. mat och kaffe Boka på www.lekebergsrevyn.se Vi har textade och syntolkade föreställningar. Se webben för info. Lekebergs revysällskap ### Studiefrämjandet Lekebergs Sparbank,2016-09-21 12:31:35,1856,,,20,1,2,1,Y,3,5,1,YES,6,1,2
,1,"YINYOGA 60+ PÅ DAGTID! Start tisdag 20 september Kl. 10.00-11.30 Kurs 6 ggr 720kr Föranmälan, max 10 personer. Enstaka tillfälle, i mån av plats, 130,-/gång OBS! Föranmälan krävs. Lärare: NN YINYOGA 60+ Kursen är för dig som är runt 60 år eller äldre. En långsam, enkel, avkopplande men samtidigt energigivande yogastil som alla kan utföra utifrån sina egna förutsättningar. Ingen tidigare erfarenhet krävs. Läs gärna mer om Yinyoga 60+ på min hemsida. www.harmonia.se Anmäl dig via www.ayogakga.se eller maila @@@ Telefon ### Välkommen!",2016-09-21 18:46:54,1856,,,3,2,1,1,Y,2,2,1,NO,6,1,2
,1,"Att skänka utrustning! Har du utrustning som du inte använder? Exempelvis: fotbollsskor, bollar, skidor, racketar, skridskor, klubbor, inlines, pulkor, pjäxor mm. Vi tar tillvara och lånar ut gratis för en aktiv fritid! Insamlingsadress Svenska kyrkan Kungsvägen 39 vardagar 10-16 lördagar 10-13 Att låna utrustning! Alla får låna - Allt är gratis - Fokus på miljön All utrustning utlånas kostnadsfritt och i befintligt skick under max 2 veckor. Kunden ansvarar för att utrustning återlämnas i gott skick. Utlåningsadress: Fritidsbanken Skogsrundan 32 C tisdagar & torsdagar 16-19",2016-09-21 18:56:25,1856,,,24,1,2,1,Y,2,2,1,NO,4,1,2